{"text_format":"1","workbook":"xlsx","n_sheets":23,"sheets":["Cover_Couverture","License","Translated Images","NOTES","Identification","MAIN_PRINCIPALE","Translated text","2","3","4+5","6","7","9","9a","10","11","12","13","CHECKLIST_LISTE DE CONTÔLE","Cont.Air_Air continue","Remote-T_T à Distance","Framing_Cadrage","Sheet1"],"not_rendered":{"charts":0,"images":79,"macros":1,"external_links":1,"defined_names":6,"comments":0,"pivot_tables":0},"unopened":[],"bounds":{"document_bytes":16777216,"sheet_cells":100000,"rows_first":2000,"rows_last":500,"rows_between":2000,"halvings":0,"cell_chars":16384,"cell_head_chars":4096},"cells_cut":0,"cells_raw":0,"read":"whole","date_system":"1900"}

{"sheet":"Cover_Couverture","index":0,"n_rows":18,"n_cols":11,"rows_kept":18,"cut":false,"hidden":false,"merged":[[17,4,17,7],[17,10,17,13],[16,4,16,7],[16,10,16,13]]}
[]
[]
[]
[]
[]
[]
[]
[]
{"$rows_left_out":11}
{"sheet":"License","index":1,"n_rows":55,"n_cols":5,"rows_kept":55,"cut":false,"hidden":false,"merged":[]}
[]
[null,"License Agreement",null,null,"Accord de licence"]
[null,"NRCAN LIC-1068 EULA",null,null,"RNCAN LIC-1068 CLU"]
[]
[null,"THIS END-USER LICENCE AGREEMENT (EULA) IS A LEGAL AGREEMENT BETWEEN YOU, THE END-USER, IN YOUR CAPACITY AS AN INDIVIDUAL AND/OR AS AN AGENT FOR YOUR COMPANY, INSTITUTION OR OTHER ENTITY (hereinafter referred to as the \"Licensee\"), AND HER MAJESTY THE QUEEN IN RIGHT OF CANADA AS REPRESENTED BY THE MINISTER OF NATURAL RESOURCES (hereinafter referred to as \"NRCan\")",null,null,"LE PRÉSENT CONTRAT DE LICENCE D’UTILISATION (CLU) CONSTITUE UNE ENTENTE JURIDIQUE ENTRE VOUS, L’UTILISATEUR, EN VOTRE NOM ET/OU À TITRE DE MANDATAIRE DE VOTRE ENTREPRISE, INSTITUTION OU AUTRE ENTITÉ (ci-après le « Concessionnaire ») ET SA MAJESTÉ LA REINE DU CHEF DU CANADA, REPRÉSENTÉE PAR LE MINISTRE DES RESSOURCES NATURELLES (ci-après « RNCan »)"]
[]
[null,"WHEREAS NRCAN HAS THE RIGHT TO GRANT A LICENSE FOR THE MASTER PLANNING AND DECISION GUIDE TOOL FOR NATURAL GAS SYSTEMS, AN EXCEL SOFTWARE TOOL WHICH HELPS BUILDERS, DESIGNERS, AND INSTALLING CONTRACTORS IDENTIFY DESIGN CHALLENGES AND PROVIDE KEY DESIGN FEATURES (hereinafter referred to as the “software”)",null,null,"ATTENDU QUE RNCAN A LE DROIT DE CONCÉDER UNE LICENCE POUR LE GUIDE PRINCIPAL DE PLANIFICATION ET DÉCISION POUR LES SYSTÈMES AU GAZ NATUREL, UN OUTIL LOGICIEL EXCEL VISANT À AIDER LES CONSTRUCTEURS, LES CONCEPTEURS ET LES INSTALLEURS À CERNER LES DÉFIS DE CONCEPTION ET À FOURNIR LES CARACTÉRISITIQUES NOMINALES PRINCIPALES (ci-après appelé le « logiciel »)"]
[]
{"$rows_left_out":48}
{"sheet":"Translated Images","index":2,"n_rows":33,"n_cols":3,"rows_kept":33,"cut":false,"hidden":true,"merged":[]}
[]
[null,"English","French"]
["Step 2 option B1"]
["Step 2 option B2"]
["Step 2 option C"]
["Step 2 option C2"]
["Step 3 option B"]
["Step 3 option C"]
{"$rows_left_out":26}
{"sheet":"NOTES","index":3,"n_rows":44,"n_cols":3,"rows_kept":44,"cut":false,"hidden":false,"merged":[[2,1,3,13],[28,1,28,13],[4,2,4,13],[16,2,16,13],[18,2,18,13],[20,2,20,13],[22,2,22,13],[26,2,26,13],[6,2,6,13],[8,2,8,13],[9,2,9,13],[10,2,10,13],[12,2,12,13],[14,2,14,13],[24,2,24,12],[29,2,29,13],[31,2,31,13],[32,2,32,13],[33,2,33,13],[34,2,34,13],[36,2,36,13],[38,2,38,13],[39,2,39,13],[41,2,41,13],[43,2,43,13],[37,2,37,13],[40,2,40,13]]}
[]
[null,"NOTES D'UTILISATION - Outil d’options CVCA"]
[null,"Un aperçu de base pour l’utilisation de cet “outil d’option CVCA” est décrit comme suit: "]
[]
[null,1,"Commencer sur l’onglet “Identification”; cliquez sur le bouton “Effacer + réinitialiser la liste de contrôle aux options par défaut” pour réinitialisez l'outil. "]
[]
[null,2,"Entrer les noms du concepteur / entrepreneur, du constructeur et du projet de logement dans l'espace ombré gris clair en haut de la page "]
[]
{"$rows_left_out":37}
{"sheet":"Identification","index":4,"n_rows":42,"n_cols":17,"rows_kept":42,"cut":false,"hidden":false,"merged":[[6,5,6,13],[8,5,8,13],[10,5,10,13],[37,11,38,13],[2,2,2,13],[31,4,31,5],[31,11,31,12],[31,7,31,9],[32,4,32,12],[30,8,30,9]]}
[]
[]
[null,null,"OUTIL PRINCIPAL DE PLANIFICATION ET DE DÉCISION POUR LES SYSTÈMES MÉCANIQUES AU GAZ NATUREL "]
[]
[null,null,"Détails d'identification: (entrer les informations dans les zones ombrées) ",null,null,null,null,null,null,null,null,null,null,null,null,null,2]
[]
[null,null,null,null,"Nom du concepteur / contracteur: "]
[]
{"$rows_left_out":35}
{"sheet":"MAIN_PRINCIPALE","index":5,"n_rows":48,"n_cols":46,"rows_kept":48,"cut":false,"hidden":false,"merged":[[15,3,23,4],[2,28,5,28],[2,29,5,29],[2,30,5,30],[2,31,5,31],[2,17,5,17],[2,18,5,18],[2,19,5,19],[2,20,5,20],[2,21,5,21],[2,22,5,22],[2,23,5,23],[2,24,5,24],[2,25,5,25],[2,26,5,26],[2,27,5,27],[11,8,11,9],[12,8,12,9],[13,8,13,9],[14,8,14,9],[17,8,17,9],[6,8,6,9],[7,8,7,9],[8,8,8,9],[9,8,9,9],[10,8,10,9],[15,37,16,37],[15,38,16,38],[29,38,30,38],[29,37,30,37],[22,8,22,9],[26,8,27,8],[18,8,18,9],[19,8,19,9],[20,8,20,9],[21,8,21,9],[24,10,24,11]]}
[]
[null,null,null,null,null,null,null,null,null,null,null,null,null,null,null,null,null,"1a","1b","2a","2b",3,4,5,6,7,8,9,10,11,12,13,null,null,null,null,null,null,null,null,null,null,null,null,"STEP 12",12]
[null,null,"Situations et défis de conception en matière de CVCA",null,null,null,null,"Sélection des priorités de conception ",null,null,null,null,null,null,null,null,null,"Close sizing of heating equipment","Close sizing of cooling equipment","Multi-stage heating equipment","Multi-stage cooling equipment","Window Selection part of HVAC Design","Framing Layout part of HVAC design","Installation of Zoned equipment","Duct Sealing","Supply Outlet placement","Air Return placement & design","Medium & High Velocity Ducts","Compact HVAC mechanicals","Use Continuous Air Circulation","Cooling Airflow Optimization & Control","T-Stat placement /remote T sensing",null,null,null,null,null,null,null,null,null,null,null,null,"STEP 10",10]
[null,null," - basé sur \" Relier les difficultés de systèmes mécaniques et les solutions possibles \" (voir l'Annexe A du GUIDE) ",null,null,null,null," - basé sur \" Relier les difficultés de systèmes mécaniques et les solutions possibles \" (voir l'Annexe A du GUIDE) ",null,null,null,null,null,null,null,null,null,null,null,null,null,null,null,null,null,null,null,null,null,null,null,null,null,null,null,null,null,null,null,null,null,null,null,null,"STEPS 4+5","4+5"]
[null,null,"INSÉRER \" x \" À CÔTÉ DE TOUTES LES SITUATIONS QUI S'APPLIQUENT AU MODÈLE DE MAISON CONSIDÉRER ",null,null,null,null,null,null,null,null,null,null,null,null,null,null,null,null,null,null,null,null,null,null,null,null,null,null,null,null,null,null,null,null,null,null,null,null,null,null,null,null,null,"STEP 7",7]
[null,null,"<-----","SITUATIONS COMMUNES DE L'INDUSTRIE DANS LES NOUVEAUX LOGEMENTS",null,null,null,0,"OPTIONS À CONSIDÉRER DANS LA CONCEPTION D'UN SYSTÈME CVCA ",null,{"$f":"IF(AJ$28>$H6, IF('Translated text'!B1=0,'Translated text'!B70,'Translated text'!C70), \"\")","v":""},null,null,null,null,null,null,null,null,null,null,null,null,null,null,null,null,null,null,null,null,null,null,null,null,null,null,null,null,null,null,null,null,null,"STEP 2",2]
[null,null,null,"a","Les charges de chauffage sont moins importantes avec une conception d'enveloppe modernes. ",null,null,{"$f":"IF($AJ$28>H6,H6+1,\"\")","v":""},{"$f":"IF(AJ$28>H6,VLOOKUP(H7,AG$18:AI$26,2,FALSE),IF('Translated text'!B1=0,'Translated text'!B54,'Translated text'!C54))","v":"(veuillez selectioner au moins une situation applicable dans liste de gauche) "},null,{"$f":"IF(AJ$28>H6,VLOOKUP(H7,AG$18:AI$26,3,FALSE),\"\")","v":""},{"$f":"IF(AJ$28>H6, HYPERLINK(\"#\"&\"'\" &VLOOKUP(K7,AS2:AT31,2,FALSE)&\"'!O2\",IF('Translated text'!B1=0,'Translated text'!B71,'Translated text'!C71)), \"\")","v":""},null,null,null,null,null,{"$f":"IF($C7<>\"\",1,0)","v":0},"X",{"$f":"IF($C7<>\"\",1,0)","v":0},"X","X","X","X","X","X","X","X",{"$f":"IF($C7<>\"\",1,0)","v":0},"X","X","X",null,null,null,null,null,null,null,null,null,null,null,null,"STEP 6",6]
[null,null,null,"b","Le coefficient de gain de chaleur solaire de la fenêtre (CGCS) est supérieur à 0,40 ou n'est PAS spécifié. ",null,null,{"$f":"IF($AJ$28>H7,H7+1,\"\")","v":""},{"$f":"IF(AJ$28>H7,VLOOKUP(H8,AG$18:AI$26,2,FALSE),\"\")","v":""},null,"",{"$f":"IF(AJ$28>H7, HYPERLINK(\"#\"&\"'\" &VLOOKUP(K8,AS2:AT31,2,FALSE)&\"'!O2\",IF('Translated text'!B1=0,'Translated text'!B71,'Translated text'!C71)), \"\")","v":""},null,null,null,null,null,"X","X",{"$f":"IF($C8<>\"\",1,0)","v":0},"X",{"$f":"IF($C8<>\"\",1,0)","v":0},"X","X","X","X","X","X","X","X","X","X",null,null,null,null,null,null,null,null,null,null,null,null,"STEP 3",3]
{"$rows_left_out":41}
{"sheet":"Translated text","index":6,"n_rows":354,"n_cols":4,"rows_kept":354,"cut":false,"hidden":true,"merged":[]}
["Language selection (0 is english, 1 is french)",1]
[null,"English","French"]
["Translate4 Button","Français","English",{"$f":"IF(B1=0,'Translated text'!B3,'Translated text'!C3)","v":"English"}]
["User notes tab"]
["x","USER NOTES – HVAC Options Tool","NOTES D'UTILISATION - Outil d’options CVCA"]
["x","A Basic outline for using this “HVAC Option Tool” is described by the following actions:","Un aperçu de base pour l’utilisation de cet “outil d’option CVCA” est décrit comme suit: "]
["x","Start on the 'Identification' TAB; Click the “Clear + Reset Checklist to Default Option” button to reset the tool.","Commencer sur l’onglet “Identification”; cliquez sur le bouton “Effacer + réinitialiser la liste de contrôle aux options par défaut” pour réinitialisez l'outil. "]
["x","Enter the Designer's / Contractor's, the Builder Name, and Housing Project name in the light-grey shaded space at the top of the page.","Entrer les noms du concepteur / entrepreneur, du constructeur et du projet de logement dans l'espace ombré gris clair en haut de la page "]
{"$rows_left_out":347}
{"sheet":"2","index":7,"n_rows":6,"n_cols":28,"rows_kept":6,"cut":false,"hidden":false,"merged":[]}
[]
[null,"ÉTAPE 2: PLACEMENTS ALTERNATIVE DES SORTIES DE RETOUR ",null,null,null,null,null,null,null,null,null,null,null,1,"RETOUR au menu principal "]
[]
[null,null,null,null,null,null,null,null,null,null,null,null,null,null,"Option par défaut - Option 2A - Alimentation de périmètre (non illustrée) "]
[null,null,null,null,null,null,null,null,null,null,null,null,null,null,"Utiliser l'option 2B: Alimentation centrale ",null,null,null,null,null,null,null,null,"Sélectionne l'option préféré",null,null,null,"Sélectionne l'option préféré"]
[null,null,null,null,null,null,null,null,null,null,null,null,null,null,"Utiliser l'option 2C: Alimentation hybride "]

{"sheet":"3","index":8,"n_rows":40,"n_cols":15,"rows_kept":40,"cut":false,"hidden":false,"merged":[]}
[]
[null," ÉTAPE 3: VITESSE / PRESSION STATIQUE DES CONDUITS D'ALIMENTATION",null,null,null,null,null,null,null,null,null,null,null,1,"RETOUR au menu principal "]
[]
[null,null,null,null,null,null,null,null,null,null,null,null,null,null,"Option par défaut - Option 3A - Conduits à basse vitesse (non illustrée) "]
[null,null,null,null,null,null,null,null,null,null,null,null,null,null,"Utiliser l'option 3B: Conduits à moyenne vitesse "]
[null,null,null,null,null,null,null,null,null,null,null,null,null,null,"Utiliser l'option 3C: Conduits à grande vitesse "]
[]
[]
{"$rows_left_out":33}
{"sheet":"4+5","index":9,"n_rows":37,"n_cols":25,"rows_kept":37,"cut":false,"hidden":false,"merged":[[4,23,5,23],[4,24,5,24],[4,22,5,22]]}
[]
[null,"ÉTAPES 4 et 5 : ZONAGE DES CONDUITS D'ALIMENTATION ET DE L'ÉQUIPEMENT",null,null,null,null,null,null,null,null,null,null,null,1,"RETOUR au menu principal ",null,null,null,null,null,null,null,null,null,{"$f":"IF(N2>1, IF(Y5=\"Option 4B\", 2, 3),1)","v":1}]
[]
[null,null,null,null,null,null,null,null,null,null,null,"Défaut - Option 5A: Le système monozone utilise un équipement non zoné (non illustré) , avec l'option 4A: alimentation à zone unique (non représentée) "]
[null,null,null,null,null,null,null,null,null,null,null,"Option 5B: L'installation entièrement zonée utilise un équipement zoné avec une alimentation zonée. ",null,null,null,null,null,null,null,null,null,null,{"$f":"IF($N$2>1, \"}\",\"\")","v":""},{"$f":"IF($N$2>1, IF('Translated text'!B1=0,'Translated text'!B141,'Translated text'!C141),\"\")","v":""},"Option 4B"]
[null,null,null,null,null,null,null,null,null,null,null,"Option 5C: L'installation prête pour le zonage utilise un équipement non zoné (non illustré) avec des conduits d'alimentation zoné. "]
[]
[null,"ÉTAPE 4: ZONAGE DES CONDUITS D'ALIMENTATION ",null,null,null,null,null,null,null,null,null,null,"ÉTAPE 5: ZONAGE AUTOMATIQUE DE L'ÉQUIPEMENT "]
{"$rows_left_out":30}
{"sheet":"6","index":10,"n_rows":34,"n_cols":15,"rows_kept":34,"cut":false,"hidden":false,"merged":[]}
[]
[null,"ÉTAPE 6: PLACEMENT ET CONCEPTION ALTERNATIVE DES PRISE DE RETOUR D'AIR ",null,null,null,null,null,null,null,null,null,null,null,1,"RETOUR au menu principal "]
[]
[null,null,null,null,null,null,null,null,null,null,null,"Par défaut - Option 6A - Système de retour d'air traditionnel (non illustré) "]
[null,null,null,null,null,null,null,null,null,null,null,"Utiliser l'option 6B: Système de retour simplifié "]
[]
[]
[]
{"$rows_left_out":27}
{"sheet":"7","index":11,"n_rows":55,"n_cols":15,"rows_kept":55,"cut":false,"hidden":false,"merged":[]}
[]
[null,"ÉTAPE 7: OPTIONS DE SCELLEMENT DES CONDUITS",null,null,null,null,null,null,null,null,null,null,null,1,"RETOUR au menu principal "]
[]
[null,null,null,null,null,null,null,null,null,null,null,null,null,null,"Option par défaut - Option 7A: Scellement de base "]
[null,null,null,null,null,null,null,null,null,null,null,null,null,null,"Utiliser l'option 7B: Scellage conforme aux exigences ENERGY STAR pour les maison neuves"]
[null,null,null,null,null,null,null,null,null,null,null,null,null,null,"Utiliser l'option 7C: Scellage conforme aux exigences  ENERGY STAR pour les maison neuves avec test de vérification "]
[]
[]
{"$rows_left_out":48}
{"sheet":"9","index":12,"n_rows":56,"n_cols":22,"rows_kept":56,"cut":false,"hidden":false,"merged":[]}
[]
[null,"ÉTAPE 9: CONCEPTION DE LA CAPACITÉ DE REFROIDISSEMENT",null,null,null,null,null,null,null,null,null,null,null,1,"RETOUR au menu principal ",null,null,null,null,null,{"$f":"IF(N2=3,U6,\"\")","v":""}]
[]
[null,null,null,null,null,null,null,null,null,null,null,null,null,null,"Option 9A: Utiliser un condensateur de climatisation de 1,0 tonne "]
[null,null,null,null,null,null,null,null,null,null,null,null,null,null,"Option 9B: Utiliser un condensateur de climatisation de 1,5 tonne "]
[null,null,null,null,null,null,null,null,null,null,null,null,null,null,"Option 9C: Utiliser un condensateur de climatisation de 2,0 tonnes ou plus; ",null,null,null,null,{"$f":"IF(N2=3,\"Specify Capacity > \",\"\")","v":""},2,{"$f":"IF(N2=3,\" Tons\",\"\")","v":""}]
[null,null,null,null,null,null,null,null,null,null,null,null,null,null,"Aucun A/C installé par le constructeur "]
[]
{"$rows_left_out":49}
{"sheet":"9a","index":13,"n_rows":8,"n_cols":15,"rows_kept":8,"cut":false,"hidden":false,"merged":[[4,11,4,23],[6,11,6,23],[5,11,5,23],[7,11,7,23],[2,3,2,13]]}
[]
[null,"ÉTAPE 9a: SÉLECTION DES FENÊTRES DANS LE CADRE DE LA CONCEPTION CVCA ",null,null,null,null,null,null,null,null,null,null,null,null,"RETOUR au menu principal "]
[null,null,null,"POUR ÉQUILIBRER LES CIRCUITS DE CHAUFFAGE ET DE REFROIDISSEMENT, ET RÉDUIRE LES DIMENSIONS DES CONDUITS D'ALIMENTATION"]
[]
[null,null,null,null,null,null,null,null,null,null,null,"Sélectionner des fenêtres avec des valeurs CGCS inférieures pour rendre égal le flux d'air de chauffage à celui de refroidissement. "]
[null,null,null,null,null,null,null,null,null,null,null," - Spécifier une petite réduction dans la valeur CGCS de la fenêtre est un moyen \" sans coût / à faible coût \" de réduire les charges de refroidissement prévues. "]
[null,null,null,null,null,null,null,null,null,null,null," - Cela réduira la taille et le coût du condensateur du climatiseur, ainsi que la taille et le coût des conduits requis. "]
[null,null,null,null,null,null,null,null,null,null,null," - Cela réduira la taille et le coût du condensateur du climatiseur, ainsi que la taille et le coût des conduits requis. "]
{"$rows_left_out":1}
{"sheet":"10","index":14,"n_rows":30,"n_cols":15,"rows_kept":30,"cut":false,"hidden":false,"merged":[]}
[]
[null,"ÉTAPE 10: STRATÉGIE DE DÉSHUMIDIFICATION ET ",null,null,null,null,null,null,null,null,null,null,null,1,"RETOUR au menu principal "]
[null,"LE MODE DE REFROIDISSEMENT - RÉGIMES / MODULATION"]
[]
[null,null,null,null,null,null,null,null,null,null,null,null,null,null,"Défaut - Option 10A - Climatisation à un régime sans stratégie de déshumidification (non présenté) "]
[null,null,null,null,null,null,null,null,null,null,null,null,null,null,"Utiliser l'option 10B - Climatisation à un régime avec contrôles de déshumidification  (ventilateur). "]
[null,null,null,null,null,null,null,null,null,null,null,null,null,null,"Utiliser l'option 10C: Climatisation à régimes ou modulation avec contrôles de déshumidification"]
[]
{"$rows_left_out":23}
{"sheet":"11","index":15,"n_rows":33,"n_cols":15,"rows_kept":33,"cut":false,"hidden":false,"merged":[]}
[]
[null,"ÉTAPE 11: DIMENSIONEMENT DE L'ÉQUIPEMENT DE CHAUFFAGE POUR SATISFAIRE LA CHARGE DE CHAUFFAGE",null,null,null,null,null,null,null,null,null,null,null,1,"RETOUR au menu principal "]
[]
[null,null,null,null,null,null,null,null,null,null,null,null,"Équipement dimensionné à l’option 11A (puissance de chauffage maximale comprise entre 100% et 125% de PCC) "]
[null,null,null,null,null,null,null,null,null,null,null,null,"Équipement dimensionné à l’option 11B (la puissance de chauffage maximale est comprise entre 126 et 175% de PCC) "]
[null,null,null,null,null,null,null,null,null,null,null,null,"Equipement dimensionné selon l'option 11C (la puissance de chauffage maximale est supérieure à 175% de PCC) "]
[]
[null,"Option 11A: entre 100% et 125% ",null,null,null,null,"Option 11B: entre 126% et 175% ",null,null,null,null,"Option 11C: supérieure à 175% "]
{"$rows_left_out":26}
{"sheet":"12","index":16,"n_rows":36,"n_cols":15,"rows_kept":36,"cut":false,"hidden":false,"merged":[]}
[]
[null,"ÉTAPE 12: CHOISIR LE MODE DE CHAUFFAGE – RÉGIMES / MODULATION",null,null,null,null,null,null,null,null,null,null,null,1,"RETOUR au menu principal "]
[]
[null,null,null,null,null,null,null,null,null,null,null,null,null,null,"Défaut - Option 12A: Installation d'un système chauffage à régime simple"]
[null,null,null,null,null,null,null,null,null,null,null,null,null,null,"Utiliser l’option 12B : Équipement de chauffage à deux régimes"]
[null,null,null,null,null,null,null,null,null,null,null,null,null,null,"Utiliser l'option 12C: Équipement de chauffage à modulation "]
[]
[]
{"$rows_left_out":29}
{"sheet":"13","index":17,"n_rows":35,"n_cols":15,"rows_kept":35,"cut":false,"hidden":false,"merged":[]}
[]
[null,"ÉTAPE 13: SÉLECTION DE L'ÉQUIPEMENT DE CHAUFFAGE ET DU CHAUFFAGE DE L'EAU",null,null,null,null,null,null,null,null,null,null,null,1,"RETOUR au menu principal "]
[]
[null,null,null,null,null,null,null,null,null,null,null,null,null,null,"Défaut - Option 13A: Fournaise et chauffe-eau "]
[null,null,null,null,null,null,null,null,null,null,null,null,null,null,"Utiliser l'option 13B: Système de chauffage combiné "]
[null,null,null,null,null,null,null,null,null,null,null,null,null,null,"Utiliser l'option 13C: Autres techniques de chauffage (veuillez préciser) "]
[]
[null,"Option 13A: Fournaise et chauffe-eau ",null,null,null,null,null,null,null,"Option 13B: Système de chauffage combiné ",null,null,null,null,"Option 13C: Autres techniques de chauffage (veuillez préciser) "]
{"$rows_left_out":28}
{"sheet":"CHECKLIST_LISTE DE CONTÔLE","index":18,"n_rows":44,"n_cols":17,"rows_kept":44,"cut":false,"hidden":false,"merged":[[4,10,6,10],[26,7,27,8],[8,10,11,11],[13,10,15,11],[16,10,17,11],[18,10,20,11],[3,7,11,8],[3,3,3,6],[5,3,5,6],[7,3,7,6],[31,7,31,8],[31,5,31,6],[15,5,15,6],[17,5,17,6],[18,5,18,6],[16,5,16,6],[29,5,29,6],[30,5,30,6],[28,5,28,6],[21,7,22,8],[23,7,23,8],[24,7,24,8],[28,7,28,8],[29,7,30,8],[19,1,20,1],[19,2,20,2],[19,3,20,3],[19,4,20,4],[19,5,20,6],[34,1,36,1],[34,2,36,2],[34,4,36,4],[21,1,22,1],[21,2,22,2],[26,1,27,1],[26,2,27,2],[29,1,30,1],[29,2,30,2],[34,3,36,3],[29,3,30,3],[29,4,30,4],[12,13,14,13],[24,5,24,6],[32,5,32,6],[33,5,33,6],[21,5,21,6],[22,5,22,6],[23,5,23,6],[25,5,25,6],[32,7,32,8],[33,7,33,8],[15,7,15,8],[25,7,25,8],[17,7,17,8],[18,7,18,8],[19,7,19,8],[20,7,20,8],[41,2,41,8],[40,2,40,8],[43,2,43,8],[34,5,34,6],[35,5,36,6],[42,2,42,8],[39,2,39,8],[38,7,38,8]]}
[]
[null,"Liste de contrôle des principales caractéristiques de conception pour les systèmes mécaniques au gaz naturel"]
[]
[null,null,"Nom du constructeur: ",{"$f":"IF(Identification!F9<>\"\",Identification!F9,\"\")","v":""},null,null,null,"Source: LEEP team, CanmetENERGY, Natural Resources Canada \nSource: Équipe PLEE, CanmetÉNERGIE, Ressources naturelles Canada"]
[null,null,null,null,null,null,null,null,null,null,"RETOUR à la page principale "]
[null,null,"Nom du concepteur: ",{"$f":"IF(Identification!F7<>\"\", Identification!F7, \"\")","v":""}]
[]
[null,null,"Identification de la maison: ",{"$f":"IF(Identification!F11<>\"\", Identification!F11,\"\")","v":""}]
{"$rows_left_out":37}
{"sheet":"Cont.Air_Air continue","index":19,"n_rows":15,"n_cols":15,"rows_kept":15,"cut":false,"hidden":false,"merged":[[13,1,13,12],[6,1,6,12],[7,1,7,12],[11,1,11,12],[12,1,12,12]]}
[]
[null,"CIRCULATION D'AIR CONTINU: ",null,null,null,null,null,null,null,null,null,null,null,null,"RETOUR au menu principal "]
[]
[]
[null,"Avantages de la circulation continue de l'air "]
[]
[null,"Les avantages du fonctionnement continu du ventilateur de la fournaise pendant les saisons de chauffage et de climatisation est une amélioration de la circulation de l'air chaud ou froid de votre maison. Cela est particulièrement vrai pour les grandes maisons ou les maisons à plusieurs étages. "]
[null," - Si vous avez une maison de deux ou trois étages avec un grand escalier, la convection naturel de l'air a tendance à chauffer l'étage supérieur et de refroidir le rez-de-chaussée.\n "]
{"$rows_left_out":8}
{"sheet":"Remote-T_T à Distance","index":20,"n_rows":2,"n_cols":15,"rows_kept":2,"cut":false,"hidden":false,"merged":[]}
[null,0]
[null,"CAPTEUR DE TEMPÉRATURE À DISTANCE POUR UN CONFORT DE REFROIDISSEMENT AMÉLIORÉ ",null,null,null,null,null,null,null,null,null,null,null,null,"RETOUR au menu principal "]

{"sheet":"Framing_Cadrage","index":21,"n_rows":29,"n_cols":15,"rows_kept":29,"cut":false,"hidden":false,"merged":[[5,2,5,10]]}
[]
[null,"PLANIFICATION DU CADRAGE FAISANT PARTIE DE LA CONCEPTION CVCA",null,null,null,null,null,null,null,null,null,null,null,null,"RETOUR au menu principal "]
[null,"POUR MINIMISER LES CLOISONS"]
[]
[]
[null,null,"Coordonner la conception du cadrage avec la conception des conduits aidera à maximiser à la fois l'espace intérieur de la maison et l'efficacité du flux d'air du système de conduits.\n\nLorsque les conceptions de conduits sont intégrées au plan du cadrage, le concepteur mécanique est en mesure de spécifier des conduits d'alimentation d'air avec moins de coudes à 90 degrés et de minimiser la plupart des cloisons à l'intérieur de la maison.\n\nLes conduits de retour d'air peuvent également bénéficier d'une planification et d'une coordination avec la conception du cadrage, ce qui contribuera à améliorer la circulation de l'air et à améliorer le confort de la maison. Un exemple de coordination de la planification des conduits avec le plan de cadrage est illustré dans la figure à droite. "]
[]
[]
{"$rows_left_out":22}
{"sheet":"Sheet1","index":22,"n_rows":18,"n_cols":3,"rows_kept":18,"cut":false,"hidden":true,"merged":[]}
[]
[]
[]
[]
[null,"House Type"]
[null,"A"]
[null,"B"]
[null,"C"]
{"$rows_left_out":10}